﻿Quota_Survey,Q01,Q02,Q03,Q0401,Q0402,Q0403,Q0404,Q0405,Q0406,Q0407,Q0408,Q0409,Q0410,Q05,Q06,Q07_Grid_Discord_Q07,Q07_Grid_Facebook_Q07,Q07_Grid_Instagram_Q07,Q07_Grid_LinkedIn_Q07,Q07_Grid_Neighbors_Q07,Q07_Grid_NextDoor_Q07,Q07_Grid_Pinterest_Q07,Q07_Grid_Reddit_Q07,Q07_Grid_Snapchat_Q07,Q07_Grid_TikTok_Q07,Q07_Grid_Tumblr_Q07,Q07_Grid_Twitch_Q07,Q07_Grid_Twitter_Q07,Q07_Grid_YouTube_Q07,Q081,Q082,Q083,Q084,Q085,Q086,Q087,Q09_Grid_BLOCKED_Q09,Q09_Grid_SHADOW_Banned1_Q09,Q09_Grid_SHADOW_Banned2_Q09,Q11,Q12,Q1301,Q1302,Q1303,Q1304,Q1305,Q1306,Q1307,Q1308,Q1309,Q1310,Q1311,Q1312,Q1313,Q1314,Q1315,Q141,Q142,Q143,Q144,Q145,Q146,Q151,Q152,Q16,Q1701,Q1702,Q1703,Q1704,Q1705,Q1706,Q1707,Q1708,Q1709,Q1710,Q1711,Q1712,Q1713,Q1714,Q1715,Q18,Q191,Q192,Q193,Q194,Q195,Q196,Q197,Q19A,Q20,Q21,Q221,Q222,Q223,Q224,Q225,Q226,Q227,Q228,Q229,Q23,Q24,Q25_Grid_You_are_less_likely_to_post_Q25,Q25_Grid_Since_being_shadow_banned_Q25,Q25_Grid_With_shadow_banning_Q25,Q25_Grid_After_being_shadow_banned_Q25,Q25_GridBeing_shadowbannedaffectedyour_abilityto_makea_livingQ25,Q25_Grid_Being_shadow_banned_made_you_feel_ashamed_Q25,Q25_Grid_Being_shadow_banned_helped_Q25,Q25_Grid_Shadow_banning_made_you_less_able_to_connect_Q25,Q25_Grid_Shadow_banning_unfairly_targets_certain_groups_Q25,Q25_Grid_Shadow_banning_helps_to_keep_social_media_Q25,Q25_Grid_Social_media_sites_should_be_able_to_shadow_ban_Q25,Q25_Grid_Social_media_sites_should_be_open_and_forthcoming_Q25,Q25_Grid_angry_Q25,Q26,Q27,Q28_Grid_individuals_less_likely_to_post_Q28,Q28_Grid_Individuals_are_less_likely_to_be_as_open_Q28,Q28_Grid_results_in_fewer_perspectives_and_points_Q28,Q28_Grid_infringeson_free_speechand_the_open_sharing_ofideas_Q28,Q28_Grid_must_be_applied_evenly_to_all_groups_and_ideas_Q28,Q28_Grid_helps_to_keep_social_media_groups_focused_Q28,Q28_Grid_can_help_users_understand_what_the_rules_Q28,Q28_Grid_Social_media_sites_should_be_able_to_shadow_ban_Q28,Q28_Grid_Social_media_sites_should_be_open_and_forthcoming_Q28,Q2901,Q2902,Q2903,Q2904,Q2905,Q2906,Q2907,Q2908,Q2909,Q2910,Q2911,Q2912,Q2913,Q2914,Q2915,Q30,Q3101,Q3102,Q3103,Q3104,Q3105,Q3106,Q3107,Q3108,Q3109,Q3110,Q32,Q331,Q332,Q34,QAge,Q35,Q36,Q37,Q38,Q39,weight
2,1,1,38,0,1,0,0,0,0,0,0,0,0,2,1,4,1,4,4,4,4,1,4,4,1,3,4,4,1,0,0,0,0,0,0,1, , , , , , , , , , , , , , , , , , , , , , , , , , , , , , , , , , , , , , , , , , , , , , , , , , , , , , , , , , , , , , , , , , , , , , , , , , , , , , , ,2,1,2,4,3,3,3,3,4,3,3,0,0,0,0,0,0,0,0,0,0,0,0,0,0,1,3,0,0,0,0,0,1,1,1,1,0,7,2,3,3,38,2,2,9,4,7,1
2,1,1,63,0,1,0,0,0,0,0,0,0,0,2,1,4,1,3,4,4,4,2,4,2,1,4,4,3,1,1,1,0,0,0,0,0, , , , , , , , , , , , , , , , , , , , , , , , , , , , , , , , , , , , , , , , , , , , , , , , , , , , , , , , , , , , , , , , , , , , , , , , , , , , , , , ,1,3,2,2,2,2,2,2,2,2,2,0,1,0,0,0,0,0,1,1,1,0,1,1,0,0,2,1,0,1,1,1,1,0,1,1,0,9,3, ,1,63,2,2,3,7,5,1
2,1,3,31,0,1,0,0,0,0,0,0,0,0,2,2,4,1,4,4,4,4,4,3,4,4,4,4,1,1,0,0,0,0,0,0,1, , , , , , , , , , , , , , , , , , , , , , , , , , , , , , , , , , , , , , , , , , , , , , , , , , , , , , , , , , , , , , , , , , , , , , , , , , , , , , , ,2,4,2,2,3,2,3,4,2,2,1,0,1,0,0,0,1,0,0,1,0,0,1,0,0,0,1,0,0,0,1,1,1,0,1,0,0,8,2,3,1,31,4,2,1,1,5,1
2,3,3,57,0,1,0,0,0,0,0,0,0,0,2,1,4,2,4,4,4,4,2,4,4,4,4,4,4,2,0,1,1,1,0,0,0,2, , , , , , , , , , , , , , , , , , , , , , , , , , , , , , , , , , , , , , , , , , , , , , , , , , , , , , , , , , , , , , , , , , , , , , , , , , , , , , ,2,4,6,6,6,6,6,6,6,6,1,0,0,0,0,0,0,0,0,0,0,0,0,0,0,1,5,0,0,0,0,0,0,0,1,0,0,8,3, ,2,57,3,2,1,3,7,1
2,2,5,46,0,1,0,0,0,0,0,0,0,0,2,1,4,1,4,3,4,4,1,4,4,4,4,4,3,2,1,0,0,0,0,0,0, , , , , , , , , , , , , , , , , , , , , , , , , , , , , , , , , , , , , , , , , , , , , , , , , , , , , , , , , , , , , , , , , , , , , , , , , , , , , , , ,2,6,1,1,1,2,2,1,1,2,1,0,0,0,0,0,0,0,1,0,1,1,1,0,0,0,3,0,0,1,0,0,1,0,0,0,0,3,1,3,2,46,3,2,4,3,3,1
2,1,3,58,1,0,0,0,0,0,0,0,0,0,2,4,4,1,1,4,4,4,4,4,1,1,4,4,1,1,1,1,0,0,0,0,0, , , , , , , , , , , , , , , , , , , , , , , , , , , , , , , , , , , , , , , , , , , , , , , , , , , , , , , , , , , , , , , , , , , , , , , , , , , , , , , ,2,4,2,1,2,2,3,3,2,1,1,0,1,0,1,1,1,1,0,1,1,0,1,1,0,0,3,0,0,1,0,0,0,0,1,1,0,8,1,2,1,58,2,2,2,1,3,1
2,1,5,63,1,0,0,0,0,0,0,0,0,0,2,3,4,1,4,4,4,4,4,4,4,4,4,4,4,3,0,0,0,0,0,0,1, , , , , , , , , , , , , , , , , , , , , , , , , , , , , , , , , , , , , , , , , , , , , , , , , , , , , , , , , , , , , , , , , , , , , , , , , , , , , , , ,2,5,1,1,3,1,1,2,2,2,1,0,0,0,0,0,0,0,0,0,0,0,0,0,0,1,3,0,0,0,0,0,1,0,1,0,0,8,1, ,5,63,2,2,1,6,4,1
2,1,5,23,0,1,0,0,0,0,0,0,0,0,2,1,4,1,1,2,4,4,3,4,1,1,4,4,2,1,0,0,0,0,0,1,0, , , , , , , , , , , , , , , , , , , , , , , , , , , , , , , , , , , , , , , , , , , , , , , , , , , , , , , , , , , , , , , , , , , , , , , , , , , , , , , , ,5,2,2,3,4,2,3,4,3,1,0,1,0,0,0,0,0,1,1,0,0,1,0,0,0,2,0,0,0,0,0,0,0,1,0,0,8,3, ,1,23,4,2,5,6,4,1
2,2,4,66,0,1,0,0,0,0,0,0,0,0,2,1,4,1,4,4,4,1,4,4,4,4,4,4,4,1,0,0,0,0,0,0,1, , , , , , , , , , , , , , , , , , , , , , , , , , , , , , , , , , , , , , , , , , , , , , , , , , , , , , , , , , , , , , , , , , , , , , , , , , , , , , , ,2,4,2,2,2,2,3,6,3,3,2,0,1,0,1,1,1,0,1,1,1,0,1,1,0,0,2,0,0,1,0,0,1,0,1,0,0,6,1, ,5,66,2,2,4,5,3,1
2,1,4,20,0,1,0,0,0,0,0,0,0,0,2,1,3,1,1,4,4,4,4,4,1,1,4,4,4,2,1,0,0,0,0,0,0, , , , , , , , , , , , , , , , , , , , , , , , , , , , , , , , , , , , , , , , , , , , , , , , , , , , , , , , , , , , , , , , , , , , , , , , , , , , , , , ,2,3,1,1,3,5,3,1,1,3,4,0,1,1,0,0,1,0,1,0,0,0,1,1,0,0,3,0,0,0,1,0,0,0,0,1,0,9,3, ,1,20,2,2,4,10,3,1
2,2,4,60,0,1,0,0,0,0,0,0,0,0,2,1,4,1,4,4,4,4,4,4,4,4,4,4,4,4,0,0,0,0,0,0,1, , , , , , , , , , , , , , , , , , , , , , , , , , , , , , , , , , , , , , , , , , , , , , , , , , , , , , , , , , , , , , , , , , , , , , , , , , , , , , , ,2,4,4,1,2,1,3,3,2,6,4,1,1,0,1,0,1,0,1,1,1,0,1,1,0,0,2,0,0,0,0,0,0,0,1,0,0,8,1, ,5,60,2,2,2,10,7,1
2,1,5,49,1,0,0,0,0,0,0,0,0,0,2,1,3,1,2,1,4,4,3,1,4,2,3,4,3,1,0,0,0,0,0,0,1, , , , , , , , , , , , , , , , , , , , , , , , , , , , , , , , , , , , , , , , , , , , , , , , , , , , , , , , , , , , , , , , , , , , , , , , , , , , , , , ,2,3,4,4,3,3,2,4,2,2,2,0,1,0,0,1,0,0,1,1,0,0,1,0,0,0,2,0,0,1,0,1,1,0,1,1,0,8,1,3,3,49,4,2,7,3,3,1
2,1,3,67,0,1,0,0,0,0,0,0,0,0,2,1,4,1,1,4,4,2,4,4,4,4,4,4,3,2,1,0,0,0,0,0,0, , , , , , , , , , , , , , , , , , , , , , , , , , , , , , , , , , , , , , , , , , , , , , , , , , , , , , , , , , , , , , , , , , , , , , , , , , , , , , , ,2,4,2,2,3,3,1,2,2,2,1,0,1,0,1,1,1,1,1,1,1,0,1,1,0,0,4,0,0,1,0,1,0,0,1,1,0,8,1,3,3,67,4,2,3,1,4,1
2,1,4,23,0,1,0,0,0,0,0,0,0,0,2,1,3,1,1,2,3,3,2,3,1,1,3,3,2,1,1,0,0,0,0,0,0, , , , , , , , , , , , , , , , , , , , , , , , , , , , , , , , , , , , , , , , , , , , , , , , , , , , , , , , , , , , , , , , , , , , , , , , , , , , , , , ,1,3,1,1,1,3,2,2,2,1,2,0,1,0,1,0,1,1,0,1,1,0,1,1,0,0,2,0,1,1,1,1,1,0,1,1,0,8,3, ,2,23,3,2,5,1,5,1
2,1,1,61,0,1,0,0,0,0,0,0,0,0,2,1,4,1,4,4,4,4,3,4,4,4,4,4,4,4,0,0,0,0,0,0,1, , , , , , , , , , , , , , , , , , , , , , , , , , , , , , , , , , , , , , , , , , , , , , , , , , , , , , , , , , , , , , , , , , , , , , , , , , , , , , , ,2,4,5,3,4,5,1,1,2,2,1,0,1,0,1,0,1,1,0,1,1,0,1,1,0,0,1,0,0,0,0,0,1,0,1,0,0,8,3, ,1,61,3,2,6,7,2,1
2,2,4,43,0,1,0,0,0,0,0,0,0,0,2,1,4,2,2,3,4,4,4,2,4,2,4,4,4,3,1,1,0,0,0,0,0, , , , , , , , , , , , , , , , , , , , , , , , , , , , , , , , , , , , , , , , , , , , , , , , , , , , , , , , , , , , , , , , , , , , , , , , , , , , , , , ,2,2,2,2,2,2,2,3,2,2,1,0,0,0,0,0,0,0,0,0,0,0,0,1,0,0,2,0,0,0,0,0,1,0,1,0,0,8,3, ,1,43,3,2,5,3,5,1
2,3,3,58,0,1,0,0,0,0,0,0,0,0,2,1,4,1,4,3,4,4,3,4,4,4,4,4,4,3,0,0,0,0,0,0,1, , , , , , , , , , , , , , , , , , , , , , , , , , , , , , , , , , , , , , , , , , , , , , , , , , , , , , , , , , , , , , , , , , , , , , , , , , , , , , , ,2,4,2,2,2,3,1,2,1,1,2,0,1,0,1,1,1,1,1,1,1,0,1,1,0,0,2,0,0,0,0,0,0,0,1,0,0,8,1, ,5,58,2,2,2,10,7,1
2,1,5,64,0,1,0,0,0,0,0,0,0,0,2,1,4,2,4,4,4,4,4,4,4,4,4,4,4,3,0,1,1,0,0,0,0, , , , , , , , , , , , , , , , , , , , , , , , , , , , , , , , , , , , , , , , , , , , , , , , , , , , , , , , , , , , , , , , , , , , , , , , , , , , , , , ,2,4,3,3,3,3,3,3,3,3,2,0,0,0,0,0,0,0,0,0,0,0,0,0,0,1,3,0,0,0,0,0,0,0,1,0,0,8,1, ,4,64,2,2,1,7,1,1
2,1,2,20,1,0,0,0,0,0,0,0,0,0,2,1,1,2,1,3,3,4,2,3,1,2,2,1,1,1,0,1,1,0,0,0,0, , , , , , , , , , , , , , , , , , , , , , , , , , , , , , , , , , , , , , , , , , , , , , , , , , , , , , , , , , , , , , , , , , , , , , , , , , , , , , , ,1,2,2,1,3,3,2,2,2,2,2,0,1,0,0,0,1,1,1,1,0,0,1,1,0,0,3,0,0,0,0,0,1,0,1,0,0,8,3, ,1,20,3,2,5,7,1,1
2,1,2,67,0,1,0,0,0,0,0,0,0,0,2,1,4,1,1,3,4,4,2,3,4,4,4,4,3,1,0,0,0,0,0,0,1, , , , , , , , , , , , , , , , , , , , , , , , , , , , , , , , , , , , , , , , , , , , , , , , , , , , , , , , , , , , , , , , , , , , , , , , , , , , , , , ,2,4,4,4,4,3,3,2,2,1,1,0,1,0,1,1,1,1,1,1,1,0,1,1,0,0,1,0,0,0,1,1,0,0,1,0,0,4,3, ,2,67,4,2,5,1,4,1
2,1,4,57,0,1,0,0,0,0,0,0,0,0,2,1,4,1,1,4,4,4,1,4,4,4,4,4,4,2,0,1,0,0,0,0,0, , , , , , , , , , , , , , , , , , , , , , , , , , , , , , , , , , , , , , , , , , , , , , , , , , , , , , , , , , , , , , , , , , , , , , , , , , , , , , , ,2,4,2,3,2,2,2,3,3,3,2,0,1,0,1,1,1,0,1,1,0,0,1,1,0,0,4,0,0,1,1,1,1,0,1,0,0,8,3, ,2,57,3,1,8,5,3,1
2,1,5,23,0,1,0,0,0,0,0,0,0,0,1,1,4,4,1,4,4,4,4,4,1,4,4,4,3,1,1,0,0,0,0,0,0, , , , , , , , , , , , , , , , , , , , , , , , , , , , , , , , , , , , , , , , , , , , , , , , , , , , , , , , , , , , , , , , , , , , , , , , , , , , , , , ,2,2,2,2,2,2,1,2,2,1,1,0,1,0,1,0,1,0,1,1,0,0,1,1,0,0,2,0,0,1,0,0,1,0,1,1,0,8,3, ,1,23,2,2,2,2,7,1
2,3,5,29,0,1,0,0,0,0,0,0,0,0,2,1,4,4,2,4,4,4,3,3,4,4,4,4,2,1,1,0,0,0,0,0,0, , , , , , , , , , , , , , , , , , , , , , , , , , , , , , , , , , , , , , , , , , , , , , , , , , , , , , , , , , , , , , , , , , , , , , , , , , , , , , , ,2,2,2,2,2,2,4,3,4,4,4,0,0,0,0,0,0,0,1,0,0,0,1,0,0,0,3,0,0,0,0,0,0,0,0,1,0,9,2,3,2,29,3,2,3,10,6,1
2,1,3,58,0,1,0,0,0,0,0,0,0,0,2,1,2,1,2,2,2,2,2,2,2,2,2,2,2,1,0,0,0,0,0,0,1, , , , , , , , , , , , , , , , , , , , , , , , , , , , , , , , , , , , , , , , , , , , , , , , , , , , , , , , , , , , , , , , , , , , , , , , , , , , , , , ,2,4,2,1,1,2,1,1,2,2,1,1,1,1,1,1,1,1,1,1,1,0,1,1,0,0,1,0,0,1,0,1,1,0,1,0,0,8,3, ,5,58,3,2,2,4,7,1
2,1,6,38,0,1,0,0,0,0,0,0,0,0,2,1,4,4,4,4,4,4,1,4,4,4,4,4,4,1,0,0,0,0,0,0,1, , , , , , , , , , , , , , , , , , , , , , , , , , , , , , , , , , , , , , , , , , , , , , , , , , , , , , , , , , , , , , , , , , , , , , , , , , , , , , , ,2,4,3,2,1,1,3,1,2,1,1,0,0,0,0,0,0,0,0,0,0,0,0,0,0,1,6,0,0,0,0,0,1,0,1,0,0,8,1,3,3,38,3,2,2,3,4,1
1,2,3,64,1,0,0,0,0,0,0,0,0,0,2,1,4,1,2,4,4,4,2,4,4,2,4,4,4,3,1,1,1,1,0,1,0,2, ,2,4,4,0,1,0,0,0,0,0,0,0,0,0,0,0,0,0,1,1,0,1,0,0,2,3,5,0,1,0,1,1,1,0,0,0,0,0,0,1,0,0,4,0,0,1,0,1,0,0,2,2,3,1,0,0,0,0,0,0,0,0,1,2,2,1,2,2,3,5,5,1,1,6,5,1,3, , , , , , , , , , , ,0,1,0,0,0,1,0,0,0,0,0,1,1,0,0,5,0,0,0,0,0,0,0,1,0,0,8,3, ,1,64,3,2,1,2,3,1
2,1,2,33,0,1,0,0,0,0,0,0,0,0,2,2,4,1,1,1,4,4,2,4,4,1,4,4,1,2,0,0,0,0,0,0,1, , , , , , , , , , , , , , , , , , , , , , , , , , , , , , , , , , , , , , , , , , , , , , , , , , , , , , , , , , , , , , , , , , , , , , , , , , , , , , , ,2,6,2,2,2,2,1,2,2,2,2,1,1,1,1,1,1,1,1,1,1,1,1,1,0,0,2,0,1,1,0,1,1,1,1,1,0,8,2, ,1,33,4,2,6,2,3,1
2,1,2,41,0,1,0,0,0,0,0,0,0,0,2,1,4,1,1,4,4,4,3,4,1,4,4,4,4,4,0,0,0,0,0,0,1, , , , , , , , , , , , , , , , , , , , , , , , , , , , , , , , , , , , , , , , , , , , , , , , , , , , , , , , , , , , , , , , , , , , , , , , , , , , , , , ,2,4,2,1,2,2,3,3,3,2,1,0,0,0,0,0,0,1,1,0,0,0,0,0,0,0,3,0,0,0,0,0,0,0,1,0,0,8,3, ,2,41,2,2,4,10,7,1
2,2,5,69,0,1,0,0,0,0,0,0,0,0,2,1,4,1,4,4,4,4,3,4,4,4,4,4,4,3,0,1,0,0,0,1,0, , , , , , , , , , , , , , , , , , , , , , , , , , , , , , , , , , , , , , , , , , , , , , , , , , , , , , , , , , , , , , , , , , , , , , , , , , , , , , , , ,4,2,2,2,3,2,2,6,3,3,0,1,0,1,1,0,1,0,1,1,0,1,1,0,0,2,1,0,0,0,0,1,0,1,1,0,8,2, ,1,69,4,2,9,3,3,1
2,1,2,55,0,1,0,0,0,0,0,0,0,0,2,1,4,1,4,4,4,4,4,4,4,4,4,4,4,1,0,0,0,0,0,0,1, , , , , , , , , , , , , , , , , , , , , , , , , , , , , , , , , , , , , , , , , , , , , , , , , , , , , , , , , , , , , , , , , , , , , , , , , , , , , , , ,2,4,3,3,3,3,3,3,3,3,3,0,0,0,0,0,0,0,0,0,0,0,0,0,0,1,3,0,0,0,0,0,0,0,1,0,0,8,2, ,1,55,2,2,1,10,7,1
2,2,3,19,1,0,0,0,0,0,0,0,0,0,2,1,3,4,2,4,4,4,4,4,4,4,4,2,4,1,1,0,0,1,0,0,0,4, , , , , , , , , , , , , , , , , , , , , , , , , , , , , , , , , , , , , , , , , , , , , , , , , , , , , , , , , , , , , , , , , , , , , , , , , , , , , , ,2,4,4,3,2,3,2,2,4,3,2,0,0,0,0,0,0,0,0,0,0,0,0,0,0,1,4,0,0,0,0,1,1,0,1,0,0,5,3, ,3,19,2,2,1,7,4,1
2,1,1,36,0,1,0,0,0,0,0,0,0,0,1,1,4,1,1,4,4,4,1,4,4,2,3,4,2,1,1,0,1,1,0,1,0,8, ,8, , , , , , , , , , , , , , , , , , , , , , , , , , , , , , , , , , , , , , , , , , , , , , , , , , , , , , , , , , , , , , , , , , , , , , , , , , , , , ,3,2,1,1,1,1,5,5,5,1,1,0,1,1,1,1,0,0,0,0,0,0,0,0,0,5,0,0,0,0,0,0,0,1,1,0,9,3, ,1,36,1,2,2,7,1,1
2,1,1,55,0,1,0,0,0,0,0,0,0,0,2,1,4,1,4,2,4,4,1,4,4,3,4,4,4,1,0,0,0,0,0,0,1, , , , , , , , , , , , , , , , , , , , , , , , , , , , , , , , , , , , , , , , , , , , , , , , , , , , , , , , , , , , , , , , , , , , , , , , , , , , , , , ,2,5,3,3,3,3,2,3,3,2,3,0,1,0,1,1,1,1,1,1,1,0,1,1,0,0,3,0,0,0,0,0,0,0,1,0,0,8,1,2,5,55,4,2,6,1,4,1
2,1,1,57,0,1,0,0,0,0,0,0,0,0,2,1,2,1,1,3,4,3,1,4,1,4,4,3,2,1,1,0,1,1,0,0,0,1, , , , , , , , , , , , , , , , , , , , , , , , , , , , , , , , , , , , , , , , , , , , , , , , , , , , , , , , , , , , , , , , , , , , , , , , , , , , , , ,2,4,2,2,3,2,3,3,5,2,1,0,0,0,0,0,1,1,1,1,1,0,1,0,0,0,3,0,0,1,0,0,1,0,1,0,0,8,3, ,1,57,2,2,1,7,3,1
2,2,5,25,1,0,0,0,0,0,0,0,0,0,2,2,2,3,2,4,4,4,4,3,4,4,4,1,1,1,0,0,0,1,0,0,0, , , , , , , , , , , , , , , , , , , , , , , , , , , , , , , , , , , , , , , , , , , , , , , , , , , , , , , , , , , , , , , , , , , , , , , , , , , , , , , ,2,3,1,1,1,2,1,1,5,5,1,0,1,0,0,0,0,0,1,1,0,0,1,1,0,0,3,0,0,0,0,0,0,0,1,0,0,8,3, ,1,25,2,2,2,4,2,1
2,1,1,47,0,1,0,0,0,0,0,0,0,0,2,1,4,1,4,4,4,4,1,4,4,3,4,4,4,2,1,1,0,0,0,0,0, , , , , , , , , , , , , , , , , , , , , , , , , , , , , , , , , , , , , , , , , , , , , , , , , , , , , , , , , , , , , , , , , , , , , , , , , , , , , , , ,2,4,2,1,2,3,3,4,4,1,1,0,0,0,0,0,0,0,1,0,1,0,1,1,0,0,4,0,0,1,0,1,1,0,1,1,0,8,3, ,4,47,3,2,5,7,1,1
2,2,2,31,1,0,0,0,0,0,0,0,0,0,2,1,4,1,4,4,4,4,4,4,4,4,4,4,4,1,0,0,0,0,0,0,1, , , , , , , , , , , , , , , , , , , , , , , , , , , , , , , , , , , , , , , , , , , , , , , , , , , , , , , , , , , , , , , , , , , , , , , , , , , , , , , ,2,6,3,3,3,3,3,3,3,3,3,1,0,1,0,0,1,0,0,0,0,0,0,0,0,0,2,0,0,0,0,0,1,0,0,1,0,9,3, ,4,31,2,2,5,7,3,1
2,1,3,50,0,1,0,0,0,0,0,0,0,0,2,1,4,1,4,4,4,4,4,4,4,4,4,4,4,4,1,1,0,0,0,0,0, , , , , , , , , , , , , , , , , , , , , , , , , , , , , , , , , , , , , , , , , , , , , , , , , , , , , , , , , , , , , , , , , , , , , , , , , , , , , , , ,2,4,2,2,2,1,4,5,5,3,1,0,0,0,0,0,0,0,0,0,0,0,0,0,0,1,5,0,0,0,0,0,1,0,1,1,0,8,1,3,3,50,3,2,4,6,2,1
2,1,4,51,0,1,0,0,0,0,0,0,0,0,2,1,4,1,4,4,4,1,2,4,4,4,4,4,4,2,1,0,0,0,0,0,0, , , , , , , , , , , , , , , , , , , , , , , , , , , , , , , , , , , , , , , , , , , , , , , , , , , , , , , , , , , , , , , , , , , , , , , , , , , , , , , ,2,4,4,3,1,3,3,3,3,3,1,0,0,0,0,0,0,0,0,0,0,0,0,0,0,1,3,0,0,0,0,0,0,0,1,0,0,8,3, ,1,51,2,2,1,3,3,1
2,2,3,23,0,1,0,0,0,0,0,0,0,0,2,1,4,1,4,4,4,2,4,4,3,1,4,4,4,2,1,0,1,0,0,0,0, , , , , , , , , , , , , , , , , , , , , , , , , , , , , , , , , , , , , , , , , , , , , , , , , , , , , , , , , , , , , , , , , , , , , , , , , , , , , , , ,2,4,1,1,2,2,1,2,1,2,2,0,1,0,1,1,1,1,1,1,1,0,1,1,0,0,3,0,0,0,0,0,1,0,1,1,0,8,3, ,1,23,1,2,2,4,3,1
2,3,6,63,1,0,0,0,0,0,0,0,0,0,1,6,4,1,4,4,4,4,4,4,4,4,4,4,4,1,0,0,0,0,0,0,1, , , , , , , , , , , , , , , , , , , , , , , , , , , , , , , , , , , , , , , , , , , , , , , , , , , , , , , , , , , , , , , , , , , , , , , , , , , , , , , ,2,4,1,1,1,1,5,5,5,5,1,0,0,0,0,0,0,0,0,0,0,0,0,0,0,1,5,0,0,0,0,0,0,0,0,0,1,10,1, ,5,63,3,2,3,5,2,1
2,1,1,67,1,0,0,0,0,0,0,0,0,0,2,1,4,1,4,4,4,4,4,4,4,4,4,4,4,1,1,0,0,1,0,0,0,5, , , , , , , , , , , , , , , , , , , , , , , , , , , , , , , , , , , , , , , , , , , , , , , , , , , , , , , , , , , , , , , , , , , , , , , , , , , , , , ,1,1,1,2,3,1,3,1,3,5,1,0,1,0,0,0,0,0,0,0,0,0,0,0,0,0,4,0,0,1,0,0,1,0,1,1,0,8,1, ,5,67,3,2,1,7,1,1
2,1,3,41,0,1,0,0,0,0,0,0,0,0,2,2,4,1,1,4,4,4,4,4,4,4,4,4,2,1,1,1,1,0,0,0,0, , , , , , , , , , , , , , , , , , , , , , , , , , , , , , , , , , , , , , , , , , , , , , , , , , , , , , , , , , , , , , , , , , , , , , , , , , , , , , , ,2,4,2,1,1,1,1,5,4,3,1,0,1,0,0,0,0,1,1,1,1,0,0,1,0,0,4,0,0,1,0,0,1,0,1,0,0,8,1,3,2,41,2,2,1,5,3,1
2,1,3,39,0,1,0,0,0,0,0,0,0,0,2,1,4,1,1,3,4,4,4,4,2,2,4,4,4,1,1,0,0,0,0,0,0, , , , , , , , , , , , , , , , , , , , , , , , , , , , , , , , , , , , , , , , , , , , , , , , , , , , , , , , , , , , , , , , , , , , , , , , , , , , , , , ,1,1,2,2,2,2,2,3,2,2,3,0,0,0,0,0,0,0,1,0,0,0,0,0,0,0,2,0,0,1,0,0,0,0,0,0,0,3,2, ,2,39,2,2,6,2,3,1
3,1,4,42,0,1,0,0,0,0,0,0,0,0,2,2,4,2,1,4,4,4,2,4,4,1,4,4,1,1,1,1,1,1,0,1,0,2, ,2,3,6,0,1,1,0,0,0,0,0,0,0,0,0,0,0,0,0,0,0,1,0,0,2,4,1,0,0,1,0,0,0,1,0,0,1,0,0,0,0,0,5,1,0,0,0,0,0,0, ,3,1,0,0,0,0,0,0,0,1,0, , ,1,1,1,1,4,1,4,2,1,3,2,1,1, , , , , , , , , , , ,0,0,1,0,0,0,1,0,0,1,0,0,0,0,0,4,0,0,1,1,1,0,0,0,1,0,9,3, ,1,42,3,2,3,5,3,1
2,2,4,42,0,1,0,0,0,0,0,0,0,0,2,1,3,1,4,4,4,4,3,4,2,1,4,4,4,1,0,1,0,1,0,0,0,8, , , , , , , , , , , , , , , , , , , , , , , , , , , , , , , , , , , , , , , , , , , , , , , , , , , , , , , , , , , , , , , , , , , , , , , , , , , , , , ,2,4,2,2,3,2,4,4,4,4,4,0,1,0,0,0,0,0,1,1,0,0,1,0,0,0,4,1,1,1,0,0,1,0,1,1,0,8,2,3,2,42,3,2,5,7,2,1
2,1,5,29,0,1,0,0,0,0,0,0,0,0,2,1,1,1,4,4,4,4,4,4,4,4,4,4,4,2,0,0,0,0,0,0,1, , , , , , , , , , , , , , , , , , , , , , , , , , , , , , , , , , , , , , , , , , , , , , , , , , , , , , , , , , , , , , , , , , , , , , , , , , , , , , , ,2,4,3,3,3,3,3,3,3,5,3,0,0,0,0,0,0,0,0,0,0,0,0,0,0,1,3,0,0,0,0,0,0,0,0,0,1,10,1,3,2,29,2,2,2,10,3,1
2,1,1,26,1,0,0,0,0,0,0,0,0,0,2,2,4,1,1,3,4,4,3,2,4,4,4,4,3,1,1,0,0,0,0,0,0, , , , , , , , , , , , , , , , , , , , , , , , , , , , , , , , , , , , , , , , , , , , , , , , , , , , , , , , , , , , , , , , , , , , , , , , , , , , , , , ,2,5,3,4,3,3,3,3,3,3,3,1,0,0,0,0,0,0,0,0,0,0,0,0,0,0,3,0,0,1,0,0,0,0,0,1,0,3,3, ,1,26,2,2,1,3,3,1
2,1,1,30,0,1,0,0,0,0,0,0,0,0,2,1,1,1,2,3,4,4,2,2,2,1,2,3,2,1,1,1,1,1,0,0,0,1, , , , , , , , , , , , , , , , , , , , , , , , , , , , , , , , , , , , , , , , , , , , , , , , , , , , , , , , , , , , , , , , , , , , , , , , , , , , , , ,2,2,1,1,1,2,2,2,2,2,2,0,0,1,0,1,1,1,1,0,0,0,0,1,0,0,2,0,0,1,0,1,1,0,1,1,0,8,3, ,1,30,2,2,3,3,5,1
2,1,1,39,1,0,0,0,0,0,0,0,0,0,2,3,3,2,1,1,2,1,1,2,2,1,1,3,1,1,1,0,0,1,0,0,0,1, , , , , , , , , , , , , , , , , , , , , , , , , , , , , , , , , , , , , , , , , , , , , , , , , , , , , , , , , , , , , , , , , , , , , , , , , , , , , , ,1,2,1,1,1,1,2,1,2,1,2,0,1,1,0,0,0,0,1,1,0,0,0,1,0,0,1,1,0,0,1,1,0,0,0,0,0,4,1,3,1,39,4,2,4,1,5,1
2,1,1,26,0,1,0,0,0,0,0,0,0,0,2,1,3,1,1,3,4,4,1,4,2,1,4,4,4,1,1,0,0,1,0,0,0,1, , , , , , , , , , , , , , , , , , , , , , , , , , , , , , , , , , , , , , , , , , , , , , , , , , , , , , , , , , , , , , , , , , , , , , , , , , , , , , ,1,1,1,4,1,2,1,3,3,3,1,0,1,0,0,1,0,1,1,1,1,0,0,1,0,0,4,0,0,0,0,1,1,0,1,0,0,5,3, ,1,26,2,2,3,10,7,1
2,1,1,32,0,1,0,0,0,0,0,0,0,0,2,1,4,1,4,4,4,4,4,4,1,1,4,4,4,1,1,0,0,1,0,0,0,3, , , , , , , , , , , , , , , , , , , , , , , , , , , , , , , , , , , , , , , , , , , , , , , , , , , , , , , , , , , , , , , , , , , , , , , , , , , , , , ,2,3,1,1,1,1,4,4,5,5,2,0,1,0,0,0,1,0,1,1,0,0,0,0,0,0,5,0,0,0,0,0,1,0,0,0,0,6,3, ,1,32,2,2,9,10,6,1
2,3,5,60,0,1,0,0,0,0,0,0,0,0,2,1,4,1,3,4,4,4,3,4,4,4,4,4,4,2,0,0,0,0,0,0,1, , , , , , , , , , , , , , , , , , , , , , , , , , , , , , , , , , , , , , , , , , , , , , , , , , , , , , , , , , , , , , , , , , , , , , , , , , , , , , , ,2,4,2,2,2,2,3,3,3,3,2,0,0,0,0,0,0,0,0,0,0,0,0,0,0,1,3,0,0,0,0,0,1,0,1,0,0,8,3, ,1,60,4,2,9,1,3,1
2,1,1,40,1,0,0,0,0,0,0,0,0,0,2,1,3,1,1,2,4,4,1,1,1,1,1,1,1,1,0,1,0,1,0,0,0,1, , , , , , , , , , , , , , , , , , , , , , , , , , , , , , , , , , , , , , , , , , , , , , , , , , , , , , , , , , , , , , , , , , , , , , , , , , , , , , ,2,2,1,2,2,1,2,2,3,5,2,1,0,1,0,0,0,0,0,0,0,1,0,0,0,0,3,0,0,1,1,1,1,1,1,1,0,8,1,3,1,40,3,2,2,4,3,1
2,1,4,26,0,1,0,0,0,0,0,0,0,0,2,1,4,1,1,3,4,4,1,1,4,1,1,4,1,1,0,0,0,0,0,0,1, , , , , , , , , , , , , , , , , , , , , , , , , , , , , , , , , , , , , , , , , , , , , , , , , , , , , , , , , , , , , , , , , , , , , , , , , , , , , , , ,2,4,2,2,3,3,3,3,4,3,1,0,0,0,0,0,1,0,1,1,1,0,0,0,0,0,3,0,0,0,0,1,0,0,1,0,0,8,1,3,3,26,4,2,2,2,4,1
2,1,4,60,0,1,0,0,0,0,0,0,0,0,2,1,4,1,4,4,4,4,3,4,4,4,4,4,4,3,0,0,0,0,0,0,1, , , , , , , , , , , , , , , , , , , , , , , , , , , , , , , , , , , , , , , , , , , , , , , , , , , , , , , , , , , , , , , , , , , , , , , , , , , , , , , ,2,5,4,3,2,3,3,3,3,3,3,0,0,0,0,0,0,0,0,0,0,0,0,0,0,1,2,0,0,0,0,1,0,0,0,0,0,5,3, ,3,60,2,2,1,1,3,1
1,1,1,40,1,0,0,0,0,0,0,0,0,0,2,1,4,1,4,4,4,4,4,4,4,1,4,4,4,1,1,1,0,0,0,1,0, , ,3,1,9,0,1,0,0,0,0,0,0,0,0,0,0,0,0,0,0,0,0,0,1,0,2,1,2,0,0,0,0,0,0,0,0,0,0,1,0,0,0,0,5,0,0,1,0,1,0,0,2,2,4,0,0,0,0,0,0,0,1,0, , ,2,1,1,3,5,2,5,2,2,4,2,2,2, , , , , , , , , , , ,0,1,0,0,0,1,0,0,0,0,0,0,0,0,0,3,0,0,0,0,1,1,0,1,0,0,8,3, ,1,40,1,2,1,6,2,1
2,2,2,24,0,1,0,0,0,0,0,0,0,0,2,1,4,1,4,4,3,4,1,4,3,4,4,4,4,2,0,0,0,0,0,0,1, , , , , , , , , , , , , , , , , , , , , , , , , , , , , , , , , , , , , , , , , , , , , , , , , , , , , , , , , , , , , , , , , , , , , , , , , , , , , , , ,2,5,6,6,6,6,6,6,6,6,5,0,0,0,0,0,0,0,0,0,0,0,0,0,0,1,6,0,0,0,0,0,1,0,1,0,0,6,3, ,4,24,1,2,6,5,1,1
2,1,1,19,0,1,0,0,0,0,0,0,0,0,2,1,4,1,1,3,4,4,1,4,1,1,4,4,1,1,1,0,0,0,0,0,0, , , , , , , , , , , , , , , , , , , , , , , , , , , , , , , , , , , , , , , , , , , , , , , , , , , , , , , , , , , , , , , , , , , , , , , , , , , , , , , ,2,3,2,2,2,2,2,3,2,2,3,0,1,0,0,0,1,0,0,1,0,0,1,0,0,0,3,0,0,1,1,0,1,0,1,1,0,8,1,3,1,19,3,2,6,2,3,1
2,1,1,36,0,1,0,0,0,0,0,0,0,0,2,1,4,1,4,4,4,4,4,4,1,3,4,4,4,1,0,0,0,0,0,0,1, , , , , , , , , , , , , , , , , , , , , , , , , , , , , , , , , , , , , , , , , , , , , , , , , , , , , , , , , , , , , , , , , , , , , , , , , , , , , , , ,2,4,6,6,6,6,6,6,6,6,6,0,0,0,0,0,0,0,0,0,0,0,0,0,0,1,6,0,0,0,0,0,1,0,0,0,0,6,3, ,5,36,2,2,1,7,7,1
2,1,2,24,0,1,0,0,0,0,0,0,0,0,2,5,3,1,4,2,4,4,1,2,3,4,4,4,4,1,0,1,0,0,0,0,0, , , , , , , , , , , , , , , , , , , , , , , , , , , , , , , , , , , , , , , , , , , , , , , , , , , , , , , , , , , , , , , , , , , , , , , , , , , , , , , ,2,1,2,1,2,2,4,2,3,1,1,0,1,0,1,1,1,1,1,1,1,0,1,1,0,0,2,1,0,1,0,0,1,0,1,0,0,6,1,3,2,24,4,2,6,3,5,1
2,1,5,69,0,1,0,0,0,0,0,0,0,0,2,1,4,1,4,2,4,4,4,4,4,4,4,4,4,4,0,1,1,0,1,0,0, , , , , , , , , , , , , , , , , , , , , , , , , , , , , , , , , , , , , , , , , , , , , , , , , , , , , , , , , , , , , , , , , , , , , , , , , , , , , , , , ,2,3,1,1,1,1,3,2,2,1,0,1,0,0,0,0,1,1,0,1,0,1,0,0,0,2,0,1,1,0,0,0,0,1,0,0,8,3, ,2,69,4,2,1,7,1,1
2,2,3,31,0,1,0,0,0,0,0,0,0,0,2,1,4,1,1,4,4,4,2,1,4,4,4,4,4,2,1,1,1,0,0,0,0, , , , , , , , , , , , , , , , , , , , , , , , , , , , , , , , , , , , , , , , , , , , , , , , , , , , , , , , , , , , , , , , , , , , , , , , , , , , , , , ,2,4,2,2,2,2,1,2,2,2,1,0,1,0,0,1,1,0,1,1,1,0,1,1,0,0,2,0,0,1,0,1,0,0,1,1,0,8,3, ,1,31,2,2,4,8,4,1
2,1,2,29,0,1,0,0,0,0,0,0,0,0,2,1,4,1,2,4,4,4,4,4,2,1,4,4,4,1,1,1,1,0,0,0,0, , , , , , , , , , , , , , , , , , , , , , , , , , , , , , , , , , , , , , , , , , , , , , , , , , , , , , , , , , , , , , , , , , , , , , , , , , , , , , , ,1,3,4,4,1,1,1,5,5,5,1,0,0,0,0,1,1,0,0,0,1,0,1,1,0,0,3,0,0,1,0,0,1,0,1,0,0,8,3, ,4,29,2,2,4,6,2,1
2,2,2,40,0,1,0,0,0,0,0,0,0,0,2,2,1,3,1,1,1,1,1,1,1,2,1,1,1,4,1,0,0,0,0,0,0, , , , , , , , , , , , , , , , , , , , , , , , , , , , , , , , , , , , , , , , , , , , , , , , , , , , , , , , , , , , , , , , , , , , , , , , , , , , , , , ,2,4,2,1,3,2,1,2,1,4,1,0,0,0,0,0,0,0,0,0,1,0,0,0,0,0,2,0,0,0,0,0,0,0,1,0,0,8,3, ,1,40,3,2,2,2,5,1
2,1,1,47,0,1,0,0,0,0,0,0,0,0,2,1,4,1,1,4,4,4,4,4,3,3,3,4,4,1,0,1,0,0,0,0,0, , , , , , , , , , , , , , , , , , , , , , , , , , , , , , , , , , , , , , , , , , , , , , , , , , , , , , , , , , , , , , , , , , , , , , , , , , , , , , , ,2,4,3,1,1,2,3,1,1,2,1,0,1,0,1,1,1,1,1,1,1,0,1,1,0,0,3,0,1,1,1,0,1,0,1,1,0,8,2,3,1,47,3,2,4,3,3,1